Reaction Details
TargetProtein-tyrosine kinase 2-beta
LigandBDBM50418581
Substrate/Competitorn/a
Meas. Tech.ChEMBL_749784 (CHEMBL1787944)
IC50 65±n/a nM
Citation Walker, DPZawistoski, MPMcGlynn, MALi, JCKung, DWBonnette, PCBaumann, ABuckbinder, LHouser, JABoer, JMistry, AHan, SXing, LGuzman-Perez, A Sulfoximine-substituted trifluoromethylpyrimidine analogs as inhibitors of proline-rich tyrosine kinase 2 (PYK2) show reduced hERG activity. Bioorg Med Chem Lett19:3253-8 (2009) 
 
Protein-tyrosine kinase 2-beta
Name:Protein-tyrosine kinase 2-beta
Type:Protein
Mol. Mass.:115868.80
Organism:Homo sapiens (Human)
Description:Q14289
Residue:1009
BDBM50418581
NameBDBM50418581
Synonyms:CHEMBL2029183
TypeSmall organic molecule
Emp. Form.C19H25F3N6OS
Mol. Mass.442.502
SMILESCN(C)[C@@H]1CCC[C@H]1Nc1nc(Nc2ccc(cc2)S(N)(=C)=O)ncc1C(F)(F)F