Reaction Details
TargetProtein-tyrosine kinase 2-beta
LigandBDBM50418578
Substrate/Competitorn/a
Meas. Tech.ChEMBL_749785 (CHEMBL1787945)
IC50 29±n/a nM
Citation Walker, DPZawistoski, MPMcGlynn, MALi, JCKung, DWBonnette, PCBaumann, ABuckbinder, LHouser, JABoer, JMistry, AHan, SXing, LGuzman-Perez, A Sulfoximine-substituted trifluoromethylpyrimidine analogs as inhibitors of proline-rich tyrosine kinase 2 (PYK2) show reduced hERG activity. Bioorg Med Chem Lett19:3253-8 (2009) 
 
Protein-tyrosine kinase 2-beta
Name:Protein-tyrosine kinase 2-beta
Type:Protein
Mol. Mass.:115868.80
Organism:Homo sapiens (Human)
Description:Q14289
Residue:1009
BDBM50418578
NameBDBM50418578
Synonyms:CHEMBL2029180
TypeSmall organic molecule
Emp. Form.C20H27F3N6OS
Mol. Mass.456.528
SMILESCNS(=C)(=O)c1ccc(Nc2ncc(c(N[C@@H]3CCC[C@H]3N(C)C)n2)C(F)(F)F)cc1