Reaction Details
TargetMetabotropic glutamate receptor 1
LigandBDBM50345950
Substrate/Competitorn/a
Meas. Tech.ChEMBL_749913 (CHEMBL1786743)
IC50 1.8±n/a nM
Citation Sasikumar, TKQiang, LBurnett, DAGreenlee, WJLi, CHeimark, LPramanik, BGrilli, MBertorelli, RLozza, GReggiani, A Tricyclic thienopyridine-pyrimidones/thienopyrimidine-pyrimidones as orally efficacious mGluR1 antagonists for neuropathic pain. Bioorg Med Chem Lett19:3199-203 (2009) 
 
Metabotropic glutamate receptor 1
Name:Metabotropic glutamate receptor 1
Type:Enzyme
Mol. Mass.:132358.19
Organism:Homo sapiens (Human)
Description:Q13255
Residue:1194
BDBM50345950
NameBDBM50345950
Synonyms:3-(4-Bromo-phenyl)-9-prop-2-ynylamino-3H-pyrido[3',2':4,5]thieno[3,2-d]pyrimidin-4-one | CHEMBL1784049
TypeSmall organic molecule
Emp. Form.C18H11BrN4OS
Mol. Mass.411.275
SMILESBrc1ccc(cc1)-n1cnc2c(sc3nccc(NCC#C)c23)c1=O