Reaction Details
TargetMetabotropic glutamate receptor 1
LigandBDBM50345934
Substrate/Competitorn/a
Meas. Tech.ChEMBL_749913 (CHEMBL1786743)
IC50 13±n/a nM
Citation Sasikumar, TKQiang, LBurnett, DAGreenlee, WJLi, CHeimark, LPramanik, BGrilli, MBertorelli, RLozza, GReggiani, A Tricyclic thienopyridine-pyrimidones/thienopyrimidine-pyrimidones as orally efficacious mGluR1 antagonists for neuropathic pain. Bioorg Med Chem Lett19:3199-203 (2009) 
 
Metabotropic glutamate receptor 1
Name:Metabotropic glutamate receptor 1
Type:Enzyme
Mol. Mass.:132358.19
Organism:Homo sapiens (Human)
Description:Q13255
Residue:1194
BDBM50345934
NameBDBM50345934
Synonyms:9-Allylamino-3-(4-bromo-phenyl)-3H-pyrido[3',2':4,5]thieno[3,2-d]pyrimidin-4-one | CHEMBL1783861
TypeSmall organic molecule
Emp. Form.C18H13BrN4OS
Mol. Mass.413.291
SMILESBrc1ccc(cc1)-n1cnc2c(sc3nccc(NCC=C)c23)c1=O