Reaction Details
TargetMetabotropic glutamate receptor 5
LigandBDBM50345940
Substrate/Competitorn/a
Meas. Tech.ChEMBL_749915 (CHEMBL1786745)
IC50>3000±n/a nM
Citation Sasikumar, TKQiang, LBurnett, DAGreenlee, WJLi, CHeimark, LPramanik, BGrilli, MBertorelli, RLozza, GReggiani, A Tricyclic thienopyridine-pyrimidones/thienopyrimidine-pyrimidones as orally efficacious mGluR1 antagonists for neuropathic pain. Bioorg Med Chem Lett19:3199-203 (2009) 
 
Metabotropic glutamate receptor 5
Name:Metabotropic glutamate receptor 5
Type:Enzyme
Mol. Mass.:132484.72
Organism:Homo sapiens (Human)
Description:n/a
Residue:1212
BDBM50345940
NameBDBM50345940
Synonyms:3-(4-Chloro-phenyl)-9-(2-methyl-allylamino)-3H-pyrido[3',2':4,5]thieno[3,2-d]pyrimidin-4-one | CHEMBL1783867
TypeSmall organic molecule
Emp. Form.C19H15ClN4OS
Mol. Mass.382.867
SMILESCC(=C)CNc1ccnc2sc3c(ncn(-c4ccc(Cl)cc4)c3=O)c12