Reaction Details
TargetMetabotropic glutamate receptor 1
LigandBDBM50345963
Substrate/Competitorn/a
Meas. Tech.ChEMBL_749914 (CHEMBL1786744)
Ki 62±n/a nM
Citation Sasikumar, TKQiang, LBurnett, DAGreenlee, WJLi, CHeimark, LPramanik, BGrilli, MBertorelli, RLozza, GReggiani, A Tricyclic thienopyridine-pyrimidones/thienopyrimidine-pyrimidones as orally efficacious mGluR1 antagonists for neuropathic pain. Bioorg Med Chem Lett19:3199-203 (2009) 
 
Metabotropic glutamate receptor 1
Name:Metabotropic glutamate receptor 1
Type:Enzyme Catalytic Domain
Mol. Mass.:133240.47
Organism:RAT
Description:metabotropic glutamate 1/2 0 RAT::P23385
Residue:1199
BDBM50345963
NameBDBM50345963
Synonyms:3-(3-Chloro-phenyl)-9-(2-methyl-allylamino)-3H-thieno[2,3-d:4,5-d']dipyrimidin-4-one | CHEMBL1784062
TypeSmall organic molecule
Emp. Form.C18H14ClN5OS
Mol. Mass.383.855
SMILESCC(=C)CNc1ncnc2sc3c(ncn(-c4cccc(Cl)c4)c3=O)c12