Reaction Details
TargetMetabotropic glutamate receptor 1
LigandBDBM50345952
Substrate/Competitorn/a
Meas. Tech.ChEMBL_749914 (CHEMBL1786744)
Ki 18±n/a nM
Citation Sasikumar, TKQiang, LBurnett, DAGreenlee, WJLi, CHeimark, LPramanik, BGrilli, MBertorelli, RLozza, GReggiani, A Tricyclic thienopyridine-pyrimidones/thienopyrimidine-pyrimidones as orally efficacious mGluR1 antagonists for neuropathic pain. Bioorg Med Chem Lett19:3199-203 (2009) 
 
Metabotropic glutamate receptor 1
Name:Metabotropic glutamate receptor 1
Type:Enzyme Catalytic Domain
Mol. Mass.:133240.47
Organism:RAT
Description:metabotropic glutamate 1/2 0 RAT::P23385
Residue:1199
BDBM50345952
NameBDBM50345952
Synonyms:3-(4-Chloro-phenyl)-9-(methyl-prop-2-ynyl-amino)-3H-pyrido[3',2':4,5]thieno[3,2-d]pyrimidin-4-one | CHEMBL1784051
TypeSmall organic molecule
Emp. Form.C19H13ClN4OS
Mol. Mass.380.851
SMILESCN(CC#C)c1ccnc2sc3c(ncn(-c4ccc(Cl)cc4)c3=O)c12