Reaction Details
TargetMetabotropic glutamate receptor 1
LigandBDBM50345949
Substrate/Competitorn/a
Meas. Tech.ChEMBL_749914 (CHEMBL1786744)
Ki 3.5±n/a nM
Citation Sasikumar, TKQiang, LBurnett, DAGreenlee, WJLi, CHeimark, LPramanik, BGrilli, MBertorelli, RLozza, GReggiani, A Tricyclic thienopyridine-pyrimidones/thienopyrimidine-pyrimidones as orally efficacious mGluR1 antagonists for neuropathic pain. Bioorg Med Chem Lett19:3199-203 (2009) 
 
Metabotropic glutamate receptor 1
Name:Metabotropic glutamate receptor 1
Type:Enzyme Catalytic Domain
Mol. Mass.:133240.47
Organism:RAT
Description:metabotropic glutamate 1/2 0 RAT::P23385
Residue:1199
BDBM50345949
NameBDBM50345949
Synonyms:3-(4-Methoxy-phenyl)-9-prop-2-ynylamino-3H-pyrido[3',2':4,5]thieno[3,2-d]pyrimidin-4-one | CHEMBL1783876
TypeSmall organic molecule
Emp. Form.C19H14N4O2S
Mol. Mass.362.405
SMILESCOc1ccc(cc1)-n1cnc2c(sc3nccc(NCC#C)c23)c1=O