Reaction Details
Target5-hydroxytryptamine receptor 6
LigandBDBM50345980
Substrate/Competitorn/a
Meas. Tech.ChEMBL_750092 (CHEMBL1787509)
Ki 3.8±n/a nM
Citation Liu, KGLo, JRComery, TAZhang, GMZhang, JYKowal, DMSmith, DLDi, LKerns, EHSchechter, LERobichaud, AJ Identification of a novel series of 3-piperidinyl-5-sulfonylindazoles as potent 5-HT6 ligands. Bioorg Med Chem Lett19:3214-6 (2009) 
 
5-hydroxytryptamine receptor 6
Name:5-hydroxytryptamine receptor 6
Type:G Protein-Coupled Receptor (GPCR)
Mol. Mass.:46968.43
Organism:Homo sapiens (Human)
Description:P50406
Residue:440
BDBM50345980
NameBDBM50345980
Synonyms:3-(1-methylpiperidin-4-yl)-5-(naphthalen-1-ylsulfonyl)-1H-indazole | CHEMBL1783607
TypeSmall organic molecule
Emp. Form.C23H23N3O2S
Mol. Mass.405.513
SMILESCN1CCC(CC1)c1n[nH]c2ccc(cc12)S(=O)(=O)c1cccc2ccccc12