Reaction Details
TargetCarbonic anhydrase 7
LigandBDBM35742
Substrate/Competitorn/a
Meas. Tech.ChEMBL_750233 (CHEMBL1788074)
Ki 6.1±n/a nM
Citation Güzel, OInnocenti, AScozzafava, ASalman, ASupuran, CT Carbonic anhydrase inhibitors. Phenacetyl-, pyridylacetyl- and thienylacetyl-substituted aromatic sulfonamides act as potent and selective isoform VII inhibitors. Bioorg Med Chem Lett19:3170-3 (2009) 
 
Carbonic anhydrase 7
Name:Carbonic anhydrase 7
Type:Enzyme
Mol. Mass.:29664.11
Organism:Homo sapiens (Human)
Description:Human cloned isozyme.
Residue:264
BDBM35742
NameBDBM35742
Synonyms:sulfonamide deriv., 8
TypeSmall organic molecule
Emp. Form.C10H10N4O3S2
Mol. Mass.298.341
SMILESNS(=O)(=O)c1nnc(NC(=O)Cc2ccccc2)s1