Reaction Details
TargetCarbonic anhydrase 7
LigandBDBM35739
Substrate/Competitorn/a
Meas. Tech.ChEMBL_750233 (CHEMBL1788074)
Ki 7.7±n/a nM
Citation Güzel, OInnocenti, AScozzafava, ASalman, ASupuran, CT Carbonic anhydrase inhibitors. Phenacetyl-, pyridylacetyl- and thienylacetyl-substituted aromatic sulfonamides act as potent and selective isoform VII inhibitors. Bioorg Med Chem Lett19:3170-3 (2009) 
 
Carbonic anhydrase 7
Name:Carbonic anhydrase 7
Type:Enzyme
Mol. Mass.:29664.11
Organism:Homo sapiens (Human)
Description:Human cloned isozyme.
Residue:264
BDBM35739
NameBDBM35739
Synonyms:sulfonamide deriv., 7g
TypeSmall organic molecule
Emp. Form.C13H13N3O3S
Mol. Mass.291.326
SMILESNS(=O)(=O)c1ccc(NC(=O)Cc2ccccn2)cc1