Reaction Details
TargetCarbonic anhydrase 7
LigandBDBM35727
Substrate/Competitorn/a
Meas. Tech.ChEMBL_750233 (CHEMBL1788074)
Ki 7±n/a nM
Citation Güzel, OInnocenti, AScozzafava, ASalman, ASupuran, CT Carbonic anhydrase inhibitors. Phenacetyl-, pyridylacetyl- and thienylacetyl-substituted aromatic sulfonamides act as potent and selective isoform VII inhibitors. Bioorg Med Chem Lett19:3170-3 (2009) 
 
Carbonic anhydrase 7
Name:Carbonic anhydrase 7
Type:Enzyme
Mol. Mass.:29664.11
Organism:Homo sapiens (Human)
Description:Human cloned isozyme.
Residue:264
BDBM35727
NameBDBM35727
Synonyms:sulfonamide deriv., 5b
TypeSmall organic molecule
Emp. Form.C12H11FN2O3S2
Mol. Mass.314.356
SMILESNS(=O)(=O)c1ccc(NC(=O)Cc2cccs2)c(F)c1