Reaction Details
TargetCarbonic anhydrase 1
LigandBDBM35742
Substrate/Competitorn/a
Meas. Tech.ChEMBL_750104 (CHEMBL1787521)
Ki 63±n/a nM
Citation Güzel, OInnocenti, AScozzafava, ASalman, ASupuran, CT Carbonic anhydrase inhibitors. Phenacetyl-, pyridylacetyl- and thienylacetyl-substituted aromatic sulfonamides act as potent and selective isoform VII inhibitors. Bioorg Med Chem Lett19:3170-3 (2009) 
 
Carbonic anhydrase 1
Name:Carbonic anhydrase 1
Type:Enzyme
Mol. Mass.:28873.37
Organism:Homo sapiens (Human)
Description:P00915
Residue:261
BDBM35742
NameBDBM35742
Synonyms:sulfonamide deriv., 8
TypeSmall organic molecule
Emp. Form.C10H10N4O3S2
Mol. Mass.298.341
SMILESNS(=O)(=O)c1nnc(NC(=O)Cc2ccccc2)s1