Reaction Details
TargetcGMP-specific 3',5'-cyclic phosphodiesterase
LigandBDBM50346121
Substrate/Competitorn/a
Meas. Tech.ChEMBL_750546 (CHEMBL1786307)
IC50>2000±n/a nM
Citation Naganuma, KOmura, AMaekawara, NSaitoh, MOhkawa, NKubota, TNagumo, HKodama, TTakemura, MOhtsuka, YNakamura, JTsujita, RKawasaki, KYokoi, HKawanishi, M Discovery of selective PDE4B inhibitors. Bioorg Med Chem Lett19:3174-6 (2009) 
 
cGMP-specific 3',5'-cyclic phosphodiesterase
Name:cGMP-specific 3',5'-cyclic phosphodiesterase
Type:Protein
Mol. Mass.:99975.83
Organism:Homo sapiens (Human)
Description:O76074
Residue:875
BDBM50346121
NameBDBM50346121
Synonyms:2-(4-(2-(5-chlorothiophen-2-yl)-5-ethyl-6-methylpyrimidin-4-ylamino)phenyl)acetic acid | CHEMBL1782306
TypeSmall organic molecule
Emp. Form.C19H18ClN3O2S
Mol. Mass.387.883
SMILESCCc1c(C)nc(nc1Nc1ccc(CC(O)=O)cc1)-c1ccc(Cl)s1