Reaction Details
TargetcAMP-specific 3',5'-cyclic phosphodiesterase 4B
LigandBDBM50346104
Substrate/Competitorn/a
Meas. Tech.ChEMBL_750541 (CHEMBL1786302)
IC50 68±n/a nM
Citation Naganuma, KOmura, AMaekawara, NSaitoh, MOhkawa, NKubota, TNagumo, HKodama, TTakemura, MOhtsuka, YNakamura, JTsujita, RKawasaki, KYokoi, HKawanishi, M Discovery of selective PDE4B inhibitors. Bioorg Med Chem Lett19:3174-6 (2009) 
 
cAMP-specific 3',5'-cyclic phosphodiesterase 4B
Name:cAMP-specific 3',5'-cyclic phosphodiesterase 4B
Type:Protein
Mol. Mass.:83318.87
Organism:Homo sapiens (Human)
Description:Q07343
Residue:736
BDBM50346104
NameBDBM50346104
Synonyms:4-(5-allyl-6-methyl-2-(thiophen-3-yl)pyrimidin-4-ylamino)benzoic acid | CHEMBL1782290
TypeSmall organic molecule
Emp. Form.C19H17N3O2S
Mol. Mass.351.422
SMILESCc1nc(nc(Nc2ccc(cc2)C(O)=O)c1CC=C)-c1ccsc1