Reaction Details
TargetcAMP-specific 3',5'-cyclic phosphodiesterase 4B
LigandBDBM50346111
Substrate/Competitorn/a
Meas. Tech.ChEMBL_750541 (CHEMBL1786302)
IC50 150±n/a nM
Citation Naganuma, KOmura, AMaekawara, NSaitoh, MOhkawa, NKubota, TNagumo, HKodama, TTakemura, MOhtsuka, YNakamura, JTsujita, RKawasaki, KYokoi, HKawanishi, M Discovery of selective PDE4B inhibitors. Bioorg Med Chem Lett19:3174-6 (2009) 
 
cAMP-specific 3',5'-cyclic phosphodiesterase 4B
Name:cAMP-specific 3',5'-cyclic phosphodiesterase 4B
Type:Protein
Mol. Mass.:83318.87
Organism:Homo sapiens (Human)
Description:Q07343
Residue:736
BDBM50346111
NameBDBM50346111
Synonyms:4-(5-allyl-6-methyl-2-(5-methylthiophen-2-yl)pyrimidin-4-ylamino)benzoic acid | CHEMBL1782297
TypeSmall organic molecule
Emp. Form.C20H19N3O2S
Mol. Mass.365.449
SMILESCc1ccc(s1)-c1nc(C)c(CC=C)c(Nc2ccc(cc2)C(O)=O)n1