Reaction Details
TargetcAMP-specific 3',5'-cyclic phosphodiesterase 4D
LigandBDBM50346103
Substrate/Competitorn/a
Meas. Tech.ChEMBL_750542 (CHEMBL1786303)
IC50 1300±n/a nM
Citation Naganuma, KOmura, AMaekawara, NSaitoh, MOhkawa, NKubota, TNagumo, HKodama, TTakemura, MOhtsuka, YNakamura, JTsujita, RKawasaki, KYokoi, HKawanishi, M Discovery of selective PDE4B inhibitors. Bioorg Med Chem Lett19:3174-6 (2009) 
 
cAMP-specific 3',5'-cyclic phosphodiesterase 4D
Name:cAMP-specific 3',5'-cyclic phosphodiesterase 4D
Type:Protein
Mol. Mass.:91092.69
Organism:Homo sapiens (Human)
Description:Q08499
Residue:809
BDBM50346103
NameBDBM50346103
Synonyms:4-(5-allyl-6-methyl-2-(thiophen-2-yl)pyrimidin-4-ylamino)benzoic acid | CHEMBL1782289
TypeSmall organic molecule
Emp. Form.C19H17N3O2S
Mol. Mass.351.422
SMILESCc1nc(nc(Nc2ccc(cc2)C(O)=O)c1CC=C)-c1cccs1