Reaction Details
TargetcAMP-specific 3',5'-cyclic phosphodiesterase 4D
LigandBDBM50346112
Substrate/Competitorn/a
Meas. Tech.ChEMBL_750542 (CHEMBL1786303)
IC50 760±n/a nM
Citation Naganuma, KOmura, AMaekawara, NSaitoh, MOhkawa, NKubota, TNagumo, HKodama, TTakemura, MOhtsuka, YNakamura, JTsujita, RKawasaki, KYokoi, HKawanishi, M Discovery of selective PDE4B inhibitors. Bioorg Med Chem Lett19:3174-6 (2009) 
 
cAMP-specific 3',5'-cyclic phosphodiesterase 4D
Name:cAMP-specific 3',5'-cyclic phosphodiesterase 4D
Type:Protein
Mol. Mass.:91092.69
Organism:Homo sapiens (Human)
Description:Q08499
Residue:809
BDBM50346112
NameBDBM50346112
Synonyms:4-(5-allyl-2-(5-methoxythiophen-2-yl)-6-methylpyrimidin-4-ylamino)benzoic acid | CHEMBL1782298
TypeSmall organic molecule
Emp. Form.C20H19N3O3S
Mol. Mass.381.448
SMILESCOc1ccc(s1)-c1nc(C)c(CC=C)c(Nc2ccc(cc2)C(O)=O)n1