Reaction Details
TargetHistamine H3 receptor
LigandBDBM50346189
Substrate/Competitorn/a
Meas. Tech.ChEMBL_749354 (CHEMBL1785144)
Ki 3.2±n/a nM
Citation Swanson, DMShah, CRLord, BMorton, KDvorak, LKMazur, CApodaca, RXiao, WBoggs, JDFeinstein, MWilson, SJBarbier, AJBonaventure, PLovenberg, TWCarruthers, NI Heterocyclic replacement of the central phenyl core of diamine-based histamine H3 receptor antagonists. Eur J Med Chem44:4413-25 (2009) 
 
Histamine H3 receptor
Name:Histamine H3 receptor
Type:G Protein-Coupled Receptor (GPCR)
Mol. Mass.:48691.47
Organism:Homo sapiens (Human)
Description:Binding assays were using CHO cells stably expressing hH3R receptors.
Residue:445
BDBM50346189
NameBDBM50346189
Synonyms:(4-Isopropyl-piperazin-1-yl)-(5-piperidin-1-ylmethylthiophen-3-yl)-methanone | CHEMBL1783877
TypeSmall organic molecule
Emp. Form.C18H29N3OS
Mol. Mass.335.507
SMILESCC(C)N1CCN(CC1)C(=O)c1csc(CN2CCCCC2)c1