Reaction Details
TargetHistamine H3 receptor
LigandBDBM50217581
Substrate/Competitorn/a
Meas. Tech.ChEMBL_749354 (CHEMBL1785144)
Ki 2.1±n/a nM
Citation Swanson, DMShah, CRLord, BMorton, KDvorak, LKMazur, CApodaca, RXiao, WBoggs, JDFeinstein, MWilson, SJBarbier, AJBonaventure, PLovenberg, TWCarruthers, NI Heterocyclic replacement of the central phenyl core of diamine-based histamine H3 receptor antagonists. Eur J Med Chem44:4413-25 (2009) 
 
Histamine H3 receptor
Name:Histamine H3 receptor
Type:G Protein-Coupled Receptor (GPCR)
Mol. Mass.:48691.47
Organism:Homo sapiens (Human)
Description:Binding assays were using CHO cells stably expressing hH3R receptors.
Residue:445
BDBM50217581
NameBDBM50217581
Synonyms:4-(4-(1-isopropylpiperidin-4-yloxy)benzyl)morpholine CHEMBL194092
TypeSmall organic molecule
Emp. Form.C19H30N2O2
Mol. Mass.318.4537
SMILESCC(C)N1CCC(CC1)Oc1ccc(CN2CCOCC2)cc1