Reaction Details
TargetNeuropeptide Y receptor type 5
LigandBDBM50346229
Substrate/Competitorn/a
Meas. Tech.ChEMBL_749577 (CHEMBL1787186)
IC50 15.7±n/a nM
Citation Ando, MSato, NNagase, TNagai, KIshikawa, STakahashi, HOhtake, NIto, JHirayama, MMitobe, YIwaasa, HGomori, AMatsushita, HTadano, KFujino, NTanaka, SOhe, TIshihara, AKanatani, AFukami, T Discovery of pyridone-containing imidazolines as potent and selective inhibitors of neuropeptide Y Y5 receptor. Bioorg Med Chem17:6106-22 (2009) 
 
Neuropeptide Y receptor type 5
Name:Neuropeptide Y receptor type 5
Type:Enzyme
Mol. Mass.:50746.64
Organism:Homo sapiens (Human)
Description:Q15761
Residue:445
BDBM50346229
NameBDBM50346229
Synonyms:5-[(4S,5S)-4-(4-Fluorophenyl)-4-(6-fluoropyridin-3-yl)-5-methyl-4,5-dihydro-1H-imidazol-2-yl]-1-methoxypyridin-2(1H)-one | CHEMBL1784131
TypeSmall organic molecule
Emp. Form.C21H18F2N4O2
Mol. Mass.396.39
SMILESCOn1cc(ccc1=O)C1=N[C@@]([C@H](C)N1)(c1ccc(F)cc1)c1ccc(F)nc1