Reaction Details
TargetNeuropeptide Y receptor type 5
LigandBDBM50249758
Substrate/Competitorn/a
Meas. Tech.ChEMBL_749582 (CHEMBL1787191)
Ki 1.3±n/a nM
Citation Ando, MSato, NNagase, TNagai, KIshikawa, STakahashi, HOhtake, NIto, JHirayama, MMitobe, YIwaasa, HGomori, AMatsushita, HTadano, KFujino, NTanaka, SOhe, TIshihara, AKanatani, AFukami, T Discovery of pyridone-containing imidazolines as potent and selective inhibitors of neuropeptide Y Y5 receptor. Bioorg Med Chem17:6106-22 (2009) 
 
Neuropeptide Y receptor type 5
Name:Neuropeptide Y receptor type 5
Type:Enzyme
Mol. Mass.:50746.64
Organism:Homo sapiens (Human)
Description:Q15761
Residue:445
BDBM50249758
NameBDBM50249758
Synonyms:2-[(4S,5S)-4-(4-Fluorophenyl)-4-(6-fluoro-3-pyridyl)-5-methyl-4,5-dihydro-1H-imidazol-2-yl]-4-pyridinecarbonitrile | CHEMBL491288
TypeSmall organic molecule
Emp. Form.C21H15F2N5
Mol. Mass.375.3741
SMILESC[C@@H]1NC(=N[C@@]1(c1ccc(F)cc1)c1ccc(F)nc1)c1cc(ccn1)C#N