Reaction Details
TargetC-C chemokine receptor type 2
LigandBDBM50337619
Substrate/Competitorn/a
Meas. Tech.ChEMBL_750500 (CHEMBL1786261)
IC50 3.2±n/a nM
Citation Hughes, RORogier, DJDevraj, RZheng, CCao, GFeng, HXia, MAnand, RXing, LGlenn, JZhang, KCovington, MMorton, PAHutzler, JMDavis, JWScherle, PBaribaud, FBahinski, AMo, ZLNewton, RMetcalf, BXue, CB Discovery of ((1S,3R)-1-isopropyl-3-((3S,4S)-3-methoxy-tetrahydro-2H-pyran-4-ylamino)cyclopentyl)(4-(5-(trifluoromethyl)pyridazin-3-yl)piperazin-1-yl)methanone, PF-4254196, a CCR2 antagonist with an improved cardiovascular profile. Bioorg Med Chem Lett21:2626-30 (2011) 
 
C-C chemokine receptor type 2
Name:C-C chemokine receptor type 2
Type:Enzyme
Mol. Mass.:41932.32
Organism:Homo sapiens (Human)
Description:P41597
Residue:374
BDBM50337619
NameBDBM50337619
Synonyms:((1S,3R)-1-isopropyl-3-((3S,4S)-3-methoxytetrahydro-2H-pyran-4-ylamino)cyclopentyl)(4-(4-(trifluoromethyl)pyridin-2-yl)piperazin-1-yl)methanone CHEMBL1683074
TypeSmall organic molecule
Emp. Form.C25H37F3N4O3
Mol. Mass.498.5815
SMILESCO[C@@H]1COCC[C@@H]1N[C@@H]1CC[C@](C1)(C(C)C)C(=O)N1CCN(CC1)c1cc(ccn1)C(F)(F)F