Reaction Details
TargetSubstance-P receptor
LigandBDBM50033817
Substrate/Competitorn/a
Meas. Tech.ChEMBL_749287 (CHEMBL1785222)
IC50 25±n/a nM
Citation Ballet, SFeytens, DBuysse, KChung, NNLemieux, CTumati, SKeresztes, AVan Duppen, JLai, JVarga, EPorreca, FSchiller, PWVanden Broeck, JTourwé, D Design of novel neurokinin 1 receptor antagonists based on conformationally constrained aromatic amino acids and discovery of a potent chimeric opioid agonist-neurokinin 1 receptor antagonist. J Med Chem54:2467-76 (2011) 
 
Substance-P receptor
Name:Substance-P receptor
Type:G Protein-Coupled Receptor (GPCR)
Mol. Mass.:46254.43
Organism:Homo sapiens (Human)
Description:P25103
Residue:407
BDBM50033817
NameBDBM50033817
Synonyms:3-(3,5-Bis-trifluoromethyl-benzyl)-5-(1H-indol-3-ylmethyl)-oxazolidine-2,4-dione CHEMBL367711
TypeSmall organic molecule
Emp. Form.C21H14F6N2O3
Mol. Mass.456.3379
SMILESOc1c(Cc2c[nH]c3ccccc23)oc(=O)n1Cc1cc(cc(c1)C(F)(F)F)C(F)(F)F