Reaction Details
TargetMu-type opioid receptor
LigandBDBM50346330
Substrate/Competitorn/a
Meas. Tech.ChEMBL_749289 (CHEMBL1785224)
IC50 0.32±n/a nM
Citation Ballet, SFeytens, DBuysse, KChung, NNLemieux, CTumati, SKeresztes, AVan Duppen, JLai, JVarga, EPorreca, FSchiller, PWVanden Broeck, JTourwé, D Design of novel neurokinin 1 receptor antagonists based on conformationally constrained aromatic amino acids and discovery of a potent chimeric opioid agonist-neurokinin 1 receptor antagonist. J Med Chem54:2467-76 (2011) 
 
Mu-type opioid receptor
Name:Mu-type opioid receptor
Type:Enzyme Catalytic Domain
Mol. Mass.:11165.58
Organism:GUINEA PIG
Description:P97266
Residue:98
BDBM50346330
NameBDBM50346330
Synonyms:(R)-N-((S)-2-(2-amino-2-oxoethyl)-3-oxo-2,3,4,5-tetrahydro-1H-benzo[c]azepin-4-yl)-2-((S)-2-amino-3-(4-hydroxy-2,6-dimethylphenyl)propanamido)-5-guanidinopentanamide | CHEMBL1782140
TypeSmall organic molecule
Emp. Form.C29H40N8O5
Mol. Mass.580.6785
SMILES[#6]-c1cc(-[#8])cc(-[#6])c1-[#6]-[#6@H](-[#7])-[#6](=O)-[#7]-[#6@H](-[#6]-[#6]-[#6]\[#7]=[#6](\[#7])-[#7])-[#6](=O)-[#7]-[#6@H]-1-[#6]-c2ccccc2-[#6]-[#7](-[#6]-[#6](-[#7])=O)-[#6]-1=O