Reaction Details
TargetSubstance-P receptor
LigandBDBM50346328
Substrate/Competitorn/a
Meas. Tech.ChEMBL_749318 (CHEMBL1785099)
Kd 3.98±n/a nM
Citation Ballet, SFeytens, DBuysse, KChung, NNLemieux, CTumati, SKeresztes, AVan Duppen, JLai, JVarga, EPorreca, FSchiller, PWVanden Broeck, JTourwé, D Design of novel neurokinin 1 receptor antagonists based on conformationally constrained aromatic amino acids and discovery of a potent chimeric opioid agonist-neurokinin 1 receptor antagonist. J Med Chem54:2467-76 (2011) 
 
Substance-P receptor
Name:Substance-P receptor
Type:G Protein-Coupled Receptor (GPCR)
Mol. Mass.:46254.43
Organism:Homo sapiens (Human)
Description:P25103
Residue:407
BDBM50346328
NameBDBM50346328
Synonyms:(S)-2-(4-acetamido-3-oxo-4,5-dihydro-1H-benzo[c]azepin-2(3H)-yl)-N-(3,5-bis(trifluoromethyl)benzyl)-N-methylacetamide | CHEMBL1782139
TypeSmall organic molecule
Emp. Form.C24H23F6N3O3
Mol. Mass.515.4481
SMILESCN(Cc1cc(cc(c1)C(F)(F)F)C(F)(F)F)C(=O)CN1Cc2ccccc2C[C@H](NC(C)=O)C1=O