Reaction Details
TargetCaspase-3
LigandBDBM50346373
Substrate/Competitorn/a
Meas. Tech.ChEMBL_749585 (CHEMBL1787194)
IC50 13400±n/a nM
Citation Glória, PMCoutinho, IGonçalves, LMBaptista, CSoares, JNewton, ASMoreira, RSaraiva, LSantos, MM Aspartic vinyl sulfones: inhibitors of a caspase-3-dependent pathway. Eur J Med Chem46:2141-6 (2011) 
 
Caspase-3
Name:Caspase-3
Type:Hydrolase; heterotetramer of two heterodimers
Mol. Mass.:31607.55
Organism:Homo sapiens (Human)
Description:n/a
Residue:277
BDBM50346373
NameBDBM50346373
Synonyms:(2S,5S,8S,11S)-8-(2-carboxyethyl)-11-(carboxymethyl)-2-(2-chloroacetyl)-5-isopropyl-4,7,10,13-tetraoxo-3,6,9,12-tetraazatetradecane-1-carboxylic acid | CHEMBL1782265
TypeSmall organic molecule
Emp. Form.C21H31ClN4O11
Mol. Mass.550.944
SMILESCC(C)[C@H](NC(=O)[C@H](CCC(O)=O)NC(=O)[C@H](CC(O)=O)NC(C)=O)C(=O)N[C@@H](CC(O)=O)C(=O)CCl