Reaction Details
Target5-hydroxytryptamine receptor 1A
LigandBDBM50346375
Substrate/Competitorn/a
Meas. Tech.ChEMBL_749999 (CHEMBL1787137)
Ki 0.293±n/a nM
Citation Fiorino, FMagli, EPerissutti, ESeverino, BFrecentese, FEsposito, ADe Angelis, FIncisivo, GMMassarelli, PNencini, CDi Gennaro, EBudillon, ADi Cintio, ASantagada, VCaliendo, G Synthesis of 1-naphtylpiperazine derivatives as serotoninergic ligands and their evaluation as antiproliferative agents. Eur J Med Chem46:2206-16 (2011) 
 
5-hydroxytryptamine receptor 1A
Name:5-hydroxytryptamine receptor 1A
Type:G Protein-Coupled Receptor (GPCR)
Mol. Mass.:46445.29
Organism:Rattus norvegicus (rat)
Description:Binding assays were performed using rat hippocampal membranes.
Residue:422
BDBM50346375
NameBDBM50346375
Synonyms:4-[3-[4-(naphthalen)piperazin-1-yl]propoxy]-4-aza-tricyclo [5.2.1.02,6]dec-8-ene-3,5-dione | CHEMBL1783351
TypeSmall organic molecule
Emp. Form.C26H29N3O3
Mol. Mass.431.5268
SMILESO=C1C2C3CC(C=C3)C2C(=O)N1OCCCN1CCN(CC1)c1cccc2ccccc12