Reaction Details
TargetCholinesterase
LigandBDBM13551
Substrate/Competitorn/a
Meas. Tech.ChEMBL_751135 (CHEMBL1787217)
IC50 840±n/a nM
Citation Tasso, BCatto, MNicolotti, ONovelli, FTonelli, MGiangreco, IPisani, LSparatore, ABoido, VCarotti, ASparatore, F Quinolizidinyl derivatives of bi- and tricyclic systems as potent inhibitors of acetyl- and butyrylcholinesterase with potential in Alzheimer's disease. Eur J Med Chem46:2170-84 (2011) 
 
Cholinesterase
Name:Cholinesterase
Type:Enzyme
Mol. Mass.:65643.35
Organism:Equus caballus (Horse)
Description:P81908
Residue:574
BDBM13551
NameBDBM13551
Synonyms:10-[2-(Diethylamino)-1-oxopropyl]-10H-phenothiazine AS-1397 | CHEMBL1782730
TypeSmall organic molecule
Emp. Form.C19H22N2OS
Mol. Mass.326.456
SMILESCCN(CC)C(C)C(=O)N1c2ccccc2Sc2ccccc12