Reaction Details
TargetCholinesterase
LigandBDBM50346411
Substrate/Competitorn/a
Meas. Tech.ChEMBL_751135 (CHEMBL1787217)
IC50 750±n/a nM
Citation Tasso, BCatto, MNicolotti, ONovelli, FTonelli, MGiangreco, IPisani, LSparatore, ABoido, VCarotti, ASparatore, F Quinolizidinyl derivatives of bi- and tricyclic systems as potent inhibitors of acetyl- and butyrylcholinesterase with potential in Alzheimer's disease. Eur J Med Chem46:2170-84 (2011) 
 
Cholinesterase
Name:Cholinesterase
Type:Enzyme
Mol. Mass.:65643.35
Organism:Equus caballus (Horse)
Description:P81908
Residue:574
BDBM50346411
NameBDBM50346411
Synonyms:3-(((1R,9aR)-octahydro-1H-quinolizin-1-yl)methylthio)-1-(10H-phenothiazin-10-yl)propan-1-one | CHEMBL1782736
TypeSmall organic molecule
Emp. Form.C25H30N2OS2
Mol. Mass.438.648
SMILESO=C(CCSC[C@@H]1CCCN2CCCC[C@H]12)N1c2ccccc2Sc2ccccc12