Reaction Details
TargetCholinesterase
LigandBDBM50346428
Substrate/Competitorn/a
Meas. Tech.ChEMBL_751135 (CHEMBL1787217)
IC50 1100±n/a nM
Citation Tasso, BCatto, MNicolotti, ONovelli, FTonelli, MGiangreco, IPisani, LSparatore, ABoido, VCarotti, ASparatore, F Quinolizidinyl derivatives of bi- and tricyclic systems as potent inhibitors of acetyl- and butyrylcholinesterase with potential in Alzheimer's disease. Eur J Med Chem46:2170-84 (2011) 
 
Cholinesterase
Name:Cholinesterase
Type:Enzyme
Mol. Mass.:65643.35
Organism:Equus caballus (Horse)
Description:P81908
Residue:574
BDBM50346428
NameBDBM50346428
Synonyms:10-(((1S,9aR)-octahydro-1H-quinolizin-1-yl)methyl)-10H-phenoselenazine | CHEMBL1782713
TypeSmall organic molecule
Emp. Form.C22H26N2Se
Mol. Mass.397.42
SMILESC([C@@H]1CCCN2CCCC[C@H]12)N1c2ccccc2[Se]c2ccccc12