Reaction Details
TargetAcetylcholinesterase
LigandBDBM50346416
Substrate/Competitorn/a
Meas. Tech.ChEMBL_751133 (CHEMBL1787070)
IC50 840±n/a nM
Citation Tasso, BCatto, MNicolotti, ONovelli, FTonelli, MGiangreco, IPisani, LSparatore, ABoido, VCarotti, ASparatore, F Quinolizidinyl derivatives of bi- and tricyclic systems as potent inhibitors of acetyl- and butyrylcholinesterase with potential in Alzheimer's disease. Eur J Med Chem46:2170-84 (2011) 
 
Acetylcholinesterase
Name:Acetylcholinesterase
Type:Enzyme
Mol. Mass.:67659.62
Organism:Bos taurus (bovine)
Description:n/a
Residue:613
BDBM50346416
NameBDBM50346416
Synonyms:6-chloro-2-methoxy-N-(2-(((1R,9aR)-octahydro-1H-quinolizin-1-yl)methylthio)ethyl)acridin-9-amine | CHEMBL1782742
TypeSmall organic molecule
Emp. Form.C26H32ClN3OS
Mol. Mass.470.07
SMILESCOc1ccc2nc3cc(Cl)ccc3c(NCCSC[C@@H]3CCCN4CCCC[C@H]34)c2c1