Reaction Details
TargetLeucyl-cystinyl aminopeptidase
LigandBDBM50346449
Substrate/Competitorn/a
Meas. Tech.ChEMBL_751648 (CHEMBL1787846)
Ki 351±n/a nM
Citation Andersson, HDemaegdt, HJohnsson, AVauquelin, GLindeberg, GHallberg, MErdelyi, MKarlen, AHallberg, A Potent macrocyclic inhibitors of insulin-regulated aminopeptidase (IRAP) by olefin ring-closing metathesis. J Med Chem54:3779-92 (2011) 
 
Leucyl-cystinyl aminopeptidase
Name:Leucyl-cystinyl aminopeptidase
Type:PROTEIN
Mol. Mass.:117334.10
Organism:Homo sapiens (Human)
Description:ChEMBL_1473494
Residue:1025
BDBM50346449
NameBDBM50346449
Synonyms:(2S,5S,12S,Z)-12-amino-N,2-dibenzyl-3,13-dioxo-1,4-diazacyclotridec-8-ene-5-carboxamide | CHEMBL1782890
TypeSmall organic molecule
Emp. Form.C26H32N4O3
Mol. Mass.448.5573
SMILESN[C@H]1CC\C=C/CC[C@H](NC(=O)[C@H](Cc2ccccc2)NC1=O)C(=O)NCc1ccccc1