Reaction Details
TargetLeucyl-cystinyl aminopeptidase
LigandBDBM50346451
Substrate/Competitorn/a
Meas. Tech.ChEMBL_751648 (CHEMBL1787846)
Ki 50±n/a nM
Citation Andersson, HDemaegdt, HJohnsson, AVauquelin, GLindeberg, GHallberg, MErdelyi, MKarlen, AHallberg, A Potent macrocyclic inhibitors of insulin-regulated aminopeptidase (IRAP) by olefin ring-closing metathesis. J Med Chem54:3779-92 (2011) 
 
Leucyl-cystinyl aminopeptidase
Name:Leucyl-cystinyl aminopeptidase
Type:PROTEIN
Mol. Mass.:117334.10
Organism:Homo sapiens (Human)
Description:ChEMBL_1473494
Residue:1025
BDBM50346451
NameBDBM50346451
Synonyms:2-(2-(((2S,5S,12S,E)-12-amino-2-(4-hydroxybenzyl)-3,13-dioxo-1,4-diazacyclotridec-8-ene-5-carboxamido)methyl)phenyl)acetic acid | CHEMBL1782885
TypeSmall organic molecule
Emp. Form.C28H34N4O6
Mol. Mass.522.5928
SMILESN[C@H]1CC\C=C\CC[C@H](NC(=O)[C@H](Cc2ccc(O)cc2)NC1=O)C(=O)NCc1ccccc1CC(O)=O