Reaction Details
TargetEstrogen receptor beta
LigandBDBM50346462
Substrate/Competitorn/a
Meas. Tech.ChEMBL_751834 (CHEMBL1785589)
Ki 0.38±n/a nM
Citation Bertini, SDe Cupertinis, AGranchi, CBargagli, BTuccinardi, TMartinelli, AMacchia, MGunther, JRCarlson, KEKatzenellenbogen, JAMinutolo, F Selective and potent agonists for estrogen receptor beta derived from molecular refinements of salicylaldoximes. Eur J Med Chem46:2453-62 (2011) 
 
Estrogen receptor beta
Name:Estrogen receptor beta
Type:Protein
Mol. Mass.:59238.43
Organism:Homo sapiens (Human)
Description:Q92731
Residue:530
BDBM50346462
NameBDBM50346462
Synonyms:(E)-2-chloro-4,4'-dihydroxybiphenyl-3-carbaldehyde oxime | CHEMBL1782957
TypeSmall organic molecule
Emp. Form.C13H10ClNO3
Mol. Mass.263.676
SMILESOc1ccc(cc1)-c1ccc(O)c(CN=O)c1Cl