Reaction Details
TargetEstrogen receptor
LigandBDBM50346463
Substrate/Competitorn/a
Meas. Tech.ChEMBL_751835 (CHEMBL1785590)
EC50 8.4±n/a nM
Citation Bertini, SDe Cupertinis, AGranchi, CBargagli, BTuccinardi, TMartinelli, AMacchia, MGunther, JRCarlson, KEKatzenellenbogen, JAMinutolo, F Selective and potent agonists for estrogen receptor beta derived from molecular refinements of salicylaldoximes. Eur J Med Chem46:2453-62 (2011) 
 
Estrogen receptor
Name:Estrogen receptor
Type:Protein
Mol. Mass.:66230.44
Organism:Homo sapiens (Human)
Description:P03372
Residue:595
BDBM50346463
NameBDBM50346463
Synonyms:(E)-2-chloro-3'-fluoro-4,4'-dihydroxybiphenyl-3-carbaldehyde oxime | CHEMBL1782958
TypeSmall organic molecule
Emp. Form.C13H9ClFNO3
Mol. Mass.281.667
SMILESOc1ccc(cc1F)-c1ccc(O)c(CN=O)c1Cl