Reaction Details
TargetMu-type opioid receptor
LigandBDBM50346473
Substrate/Competitorn/a
Meas. Tech.ChEMBL_751947 (CHEMBL1785789)
Ki>1000±n/a nM
Citation Sunnam, SKRack, ESchepmann, DWünsch, B Synthesis of 7,9-diazabicyclo[4.2.2]decanes as conformationally restricted κ receptor agonists: fine tuning of the dihedral angle of the ethylenediamine pharmacophore. Eur J Med Chem46:1972-82 (2011) 
 
Mu-type opioid receptor
Name:Mu-type opioid receptor
Type:Enzyme Catalytic Domain
Mol. Mass.:11165.58
Organism:GUINEA PIG
Description:P97266
Residue:98
BDBM50346473
NameBDBM50346473
Synonyms:CHEMBL1782987 rel-(1RS,2SR,6SR)-7-benzyl-9-[2-(3,4-dichlorophenyl)acetyl]-2-(pyrrolidin-1-yl)-7,9-diazabicyclo[4.2.2]decane
TypeSmall organic molecule
Emp. Form.C27H33Cl2N3O
Mol. Mass.486.476
SMILESClc1ccc(CC(=O)N2CC3CCCC(C2CN3Cc2ccccc2)N2CCCC2)cc1Cl