Reaction Details
TargetKappa-type opioid receptor
LigandBDBM50346472
Substrate/Competitorn/a
Meas. Tech.ChEMBL_751946 (CHEMBL1785788)
Ki 65.0±n/a nM
Citation Sunnam, SKRack, ESchepmann, DWünsch, B Synthesis of 7,9-diazabicyclo[4.2.2]decanes as conformationally restricted κ receptor agonists: fine tuning of the dihedral angle of the ethylenediamine pharmacophore. Eur J Med Chem46:1972-82 (2011) 
 
Kappa-type opioid receptor
Name:Kappa-type opioid receptor
Type:G Protein-Coupled Receptor (GPCR)
Mol. Mass.:42744.99
Organism:Cavia porcellus (domestic guinea pig)
Description:P41144
Residue:380
BDBM50346472
NameBDBM50346472
Synonyms:CHEMBL1782985 rel-(1RS,2SR,6SR)-methyl9-[2-(3,4-Dichlorophenyl)acetyl]-2-(pyrrolidin-1-yl)-7,9-diaza-bicyclo[4.2.2]decane-7-carboxylate
TypeSmall organic molecule
Emp. Form.C22H29Cl2N3O3
Mol. Mass.454.39
SMILESCOC(=O)N1CC2C(CCCC1CN2C(=O)Cc1ccc(Cl)c(Cl)c1)N1CCCC1