Reaction Details
TargetSigma non-opioid intracellular receptor 1
LigandBDBM50346473
Substrate/Competitorn/a
Meas. Tech.ChEMBL_751949 (CHEMBL1785791)
Ki 221±n/a nM
Citation Sunnam, SKRack, ESchepmann, DWünsch, B Synthesis of 7,9-diazabicyclo[4.2.2]decanes as conformationally restricted κ receptor agonists: fine tuning of the dihedral angle of the ethylenediamine pharmacophore. Eur J Med Chem46:1972-82 (2011) 
 
Sigma non-opioid intracellular receptor 1
Name:Sigma non-opioid intracellular receptor 1
Type:Protein
Mol. Mass.:25307.17
Organism:Cavia porcellus (Guinea pig)
Description:Q60492
Residue:223
BDBM50346473
NameBDBM50346473
Synonyms:CHEMBL1782987 rel-(1RS,2SR,6SR)-7-benzyl-9-[2-(3,4-dichlorophenyl)acetyl]-2-(pyrrolidin-1-yl)-7,9-diazabicyclo[4.2.2]decane
TypeSmall organic molecule
Emp. Form.C27H33Cl2N3O
Mol. Mass.486.476
SMILESClc1ccc(CC(=O)N2CC3CCCC(C2CN3Cc2ccccc2)N2CCCC2)cc1Cl