Reaction Details
TargetHistone-lysine N-methyltransferase EHMT2
LigandBDBM50300028
Substrate/Competitorn/a
Meas. Tech.ChEMBL_752821 (CHEMBL1798506)
IC50 2700±n/a nM
Citation Heinke, RCarlino, LKannan, SJung, MSippl, W Computer- and structure-based lead design for epigenetic targets. Bioorg Med Chem19:3605-15 (2011) 
 
Histone-lysine N-methyltransferase EHMT2
Name:Histone-lysine N-methyltransferase EHMT2
Type:Enzyme
Mol. Mass.:132339.87
Organism:Homo sapiens (Human)
Description:Q96KQ7
Residue:1210
BDBM50300028
NameBDBM50300028
Synonyms:CHEMBL569864 | N-(1-benzylpiperidin-4-yl)-6,7-dimethoxy-2-(4-methyl-1,4-diazepan-1-yl)quinazolin-4-amine
TypeSmall organic molecule
Emp. Form.C28H38N6O2
Mol. Mass.490.6403
SMILESCOc1cc2nc(nc(NC3CCN(Cc4ccccc4)CC3)c2cc1OC)N1CCCN(C)CC1