Reaction Details
TargetHistone acetyltransferase KAT2B
LigandBDBM50346554
Substrate/Competitorn/a
Meas. Tech.ChEMBL_752826 (CHEMBL1798511)
IC50 720±n/a nM
Citation Furdas, SDShekfeh, SBissinger, EMWagner, JMSchlimme, SValkov, VHendzel, MJung, MSippl, W Synthesis and biological testing of novel pyridoisothiazolones as histone acetyltransferase inhibitors. Bioorg Med Chem19:3678-89 (2011) 
 
Histone acetyltransferase KAT2B
Name:Histone acetyltransferase KAT2B
Type:PROTEIN
Mol. Mass.:93045.76
Organism:Homo sapiens (Human)
Description:ChEMBL_1502838
Residue:832
BDBM50346554
NameBDBM50346554
Synonyms:CHEMBL106011
TypeSmall organic molecule
Emp. Form.C12H7FN2OS
Mol. Mass.246.26
SMILESFc1ccc(cc1)-n1sc2ncccc2c1=O