Reaction Details
TargetHistone acetyltransferase KAT2B
LigandBDBM50346557
Substrate/Competitorn/a
Meas. Tech.ChEMBL_752826 (CHEMBL1798511)
IC50 2990±n/a nM
Citation Furdas, SDShekfeh, SBissinger, EMWagner, JMSchlimme, SValkov, VHendzel, MJung, MSippl, W Synthesis and biological testing of novel pyridoisothiazolones as histone acetyltransferase inhibitors. Bioorg Med Chem19:3678-89 (2011) 
 
Histone acetyltransferase KAT2B
Name:Histone acetyltransferase KAT2B
Type:PROTEIN
Mol. Mass.:93045.76
Organism:Homo sapiens (Human)
Description:ChEMBL_1502838
Residue:832
BDBM50346557
NameBDBM50346557
Synonyms:CHEMBL99137
TypeSmall organic molecule
Emp. Form.C12H7N3O3S
Mol. Mass.273.267
SMILES[O-][N+](=O)c1ccc(cc1)-n1sc2ncccc2c1=O