Reaction Details
TargetHistone acetyltransferase KAT2B
LigandBDBM50346555
Substrate/Competitorn/a
Meas. Tech.ChEMBL_752825 (CHEMBL1798510)
IC50 3420±n/a nM
Citation Furdas, SDShekfeh, SBissinger, EMWagner, JMSchlimme, SValkov, VHendzel, MJung, MSippl, W Synthesis and biological testing of novel pyridoisothiazolones as histone acetyltransferase inhibitors. Bioorg Med Chem19:3678-89 (2011) 
 
Histone acetyltransferase KAT2B
Name:Histone acetyltransferase KAT2B
Type:PROTEIN
Mol. Mass.:93045.76
Organism:Homo sapiens (Human)
Description:ChEMBL_1502838
Residue:832
BDBM50346555
NameBDBM50346555
Synonyms:CHEMBL1795609
TypeSmall organic molecule
Emp. Form.C13H9N3O4S
Mol. Mass.303.293
SMILESCOc1ccc(cc1)-n1sc2ncc(cc2c1=O)[N+]([O-])=O