Reaction Details
TargetHistone acetyltransferase KAT2B
LigandBDBM50346567
Substrate/Competitorn/a
Meas. Tech.ChEMBL_752825 (CHEMBL1798510)
IC50 3530±n/a nM
Citation Furdas, SDShekfeh, SBissinger, EMWagner, JMSchlimme, SValkov, VHendzel, MJung, MSippl, W Synthesis and biological testing of novel pyridoisothiazolones as histone acetyltransferase inhibitors. Bioorg Med Chem19:3678-89 (2011) 
 
Histone acetyltransferase KAT2B
Name:Histone acetyltransferase KAT2B
Type:PROTEIN
Mol. Mass.:93045.76
Organism:Homo sapiens (Human)
Description:ChEMBL_1502838
Residue:832
BDBM50346567
NameBDBM50346567
Synonyms:CHEMBL318367
TypeSmall organic molecule
Emp. Form.C12H7ClN2OS
Mol. Mass.262.715
SMILESClc1ccc(cc1)-n1sc2ncccc2c1=O