Reaction Details
TargetLysine-specific histone demethylase 1A
LigandBDBM50236898
Substrate/Competitorn/a
Meas. Tech.ChEMBL_753131 (CHEMBL1799131)
Ki 28100±n/a nM
Citation Benelkebir, HHodgkinson, CDuriez, PJHayden, ALBulleid, RACrabb, SJPackham, GGanesan, A Enantioselective synthesis of tranylcypromine analogues as lysine demethylase (LSD1) inhibitors. Bioorg Med Chem19:3709-16 (2011) 
 
Lysine-specific histone demethylase 1A
Name:Lysine-specific histone demethylase 1A
Type:Enzyme
Mol. Mass.:92901.01
Organism:Homo sapiens (Human)
Description:O60341
Residue:852
BDBM50236898
NameBDBM50236898
Synonyms:(1S,2R)-(+)-2-phenylcyclopropylamine TRANYLCYPROMINE trans-2-phenylcyclopropanamine | trans-2-phenylcyclopropylamine
TypeSmall organic molecule
Emp. Form.C9H11N
Mol. Mass.133.1903
SMILESN[C@H]1C[C@@H]1c1ccccc1