Reaction Details
TargetGlycogen phosphorylase, muscle form
LigandBDBM50346670
Substrate/Competitorn/a
Meas. Tech.ChEMBL_753234 (CHEMBL1799389)
IC50 3260±n/a nM
Citation Liang, ZZhang, LLi, LLiu, JLi, HZhang, LChen, LCheng, KZheng, MWen, XZhang, PHao, JGong, YZhang, XZhu, XChen, JLiu, HJiang, HLuo, CSun, H Identification of pentacyclic triterpenes derivatives as potent inhibitors against glycogen phosphorylase based on 3D-QSAR studies. Eur J Med Chem46:2011-21 (2011) 
 
Glycogen phosphorylase, muscle form
Name:Glycogen phosphorylase, muscle form
Type:Enzyme
Mol. Mass.:97296.32
Organism:Oryctolagus cuniculus (rabbit)
Description:Phosphorylation of Ser-15 converts phosphorylase B (unphosphorylated) to phosphorylase A.
Residue:843
BDBM50346670
NameBDBM50346670
Synonyms:CHEMBL238219
TypeSmall organic molecule
Emp. Form.C36H58O5
Mol. Mass.570.8427
SMILESCCCCCC(=O)O[C@@H]1C[C@@]2(C)[C@@H](CC[C@]3(C)[C@@H]2CC=C2[C@@H]4[C@@H](C)[C@H](C)CC[C@@]4(CC[C@@]32C)C(O)=O)C(C)(C)[C@H]1O