Reaction Details
TargetGlycogen phosphorylase, muscle form
LigandBDBM50346671
Substrate/Competitorn/a
Meas. Tech.ChEMBL_753234 (CHEMBL1799389)
IC50 5100±n/a nM
Citation Liang, ZZhang, LLi, LLiu, JLi, HZhang, LChen, LCheng, KZheng, MWen, XZhang, PHao, JGong, YZhang, XZhu, XChen, JLiu, HJiang, HLuo, CSun, H Identification of pentacyclic triterpenes derivatives as potent inhibitors against glycogen phosphorylase based on 3D-QSAR studies. Eur J Med Chem46:2011-21 (2011) 
 
Glycogen phosphorylase, muscle form
Name:Glycogen phosphorylase, muscle form
Type:Enzyme
Mol. Mass.:97296.32
Organism:Oryctolagus cuniculus (rabbit)
Description:Phosphorylation of Ser-15 converts phosphorylase B (unphosphorylated) to phosphorylase A.
Residue:843
BDBM50346671
NameBDBM50346671
Synonyms:CHEMBL395906
TypeSmall organic molecule
Emp. Form.C37H52O5
Mol. Mass.576.8058
SMILESC[C@@H]1CC[C@@]2(CC[C@]3(C)C(=CC[C@@H]4[C@@]5(C)C[C@@H](OC(=O)c6ccccc6)[C@H](O)C(C)(C)[C@@H]5CC[C@@]34C)[C@@H]2[C@H]1C)C(O)=O