Reaction Details
TargetGlycogen phosphorylase, muscle form
LigandBDBM23208
Substrate/Competitorn/a
Meas. Tech.ChEMBL_753234 (CHEMBL1799389)
IC50 43000±n/a nM
Citation Liang, ZZhang, LLi, LLiu, JLi, HZhang, LChen, LCheng, KZheng, MWen, XZhang, PHao, JGong, YZhang, XZhu, XChen, JLiu, HJiang, HLuo, CSun, H Identification of pentacyclic triterpenes derivatives as potent inhibitors against glycogen phosphorylase based on 3D-QSAR studies. Eur J Med Chem46:2011-21 (2011) 
 
Glycogen phosphorylase, muscle form
Name:Glycogen phosphorylase, muscle form
Type:Enzyme
Mol. Mass.:97296.32
Organism:Oryctolagus cuniculus (rabbit)
Description:Phosphorylation of Ser-15 converts phosphorylase B (unphosphorylated) to phosphorylase A.
Residue:843
BDBM23208
NameBDBM23208
Synonyms:(1R,2R,5S,8R,9R,10R,13R,14R,17S,19R)-17-hydroxy-1,2,14,18,18-pentamethyl-8-(prop-1-en-2-yl)pentacyclo[11.8.0.0^{2,10}.0^{5,9}.0^{14,19}]henicosane-5-carboxylic acid CHEMBL269277 | cid_64971
TypeTerpene
Emp. Form.C30H48O3
Mol. Mass.456.7003
SMILES[H][C@]12[C@@H](CC[C@@]1(CC[C@]1(C)[C@]2([H])CC[C@]2([H])[C@@]3(C)CC[C@H](O)C(C)(C)[C@]3([H])CC[C@@]12C)C(O)=O)C(C)=C