Reaction Details
TargetCarbonic anhydrase 9
LigandBDBM50346725
Substrate/Competitorn/a
Meas. Tech.ChEMBL_753460 (CHEMBL1799890)
Ki 92±n/a nM
Citation Rami, MMaresca, ASmaine, FZMontero, JLScozzafava, AWinum, JYSupuran, CT Sulfonamides incorporating boroxazolidone moieties are potent inhibitors of the transmembrane, tumor-associated carbonic anhydrase isoforms IX and XII. Bioorg Med Chem Lett21:2975-9 (2011) 
 
Carbonic anhydrase 9
Name:Carbonic anhydrase 9
Type:Enzyme
Mol. Mass.:49669.03
Organism:Homo sapiens (Human)
Description:Catalytic domain of human cloned isozyme was used in the assay
Residue:459
BDBM50346725
NameBDBM50346725
Synonyms:CHEMBL1797789
TypeSmall organic molecule
Emp. Form.C17H28BBrN4O4S2
Mol. Mass.507.274
SMILESCCB(CC)OC(=O)[C@@H](N)CCCCNC(=S)Nc1ccc(cc1Br)S(N)(=O)=O