Reaction Details
TargetHypoxia-inducible factor 1-alpha
LigandBDBM50179013
Substrate/Competitorn/a
Meas. Tech.ChEMBL_753564 (CHEMBL1799182)
IC50 6.76±n/a nM
Citation Xia, YJin, YKaur, NChoi, YLee, K HIF-1a inhibitors: synthesis and biological evaluation of novel moracin O and P analogues. Eur J Med Chem46:2386-96 (2011) 
 
Hypoxia-inducible factor 1-alpha
Name:Hypoxia-inducible factor 1-alpha
Type:Protein
Mol. Mass.:92647.24
Organism:Homo sapiens (Human)
Description:Q16665
Residue:826
BDBM50179013
NameBDBM50179013
Synonyms:CHEMBL205924 | moracin O
TypeSmall organic molecule
Emp. Form.C19H18O5
Mol. Mass.326.3432
SMILESCC(C)(O)C1Cc2cc3cc(oc3cc2O1)-c1cc(O)cc(O)c1